ICode9

精准搜索请尝试: 精确搜索
  • Multi ingress controller2020-10-16 10:00:25

    由于路由解析的问题, 需要对ingress的如果进行分离,采用多 ingress controller 的方案。 参考文档 https://kubernetes.github.io/ingress-nginx/user-guide/multiple-ingress/   主要注意事项 1. 在ingress-controller的启动参数中加入对应的--ingress-class    spec: templ

  • 浅析C#中 ConcurrentDictionary的实现2020-08-30 16:32:33

    有空 一定把这些方法搞清楚:     简单画了一张图 (灵魂画手 →_→) 如图 ConcurrentDictionary 其中有个tables 对象主要存储,而这个 tables 是一个 很多区块的 数组 ,每个区块 又是一个node的链表 (ps: 一个node 就是一个key value 对) 具体实现如下(ps 代码摘自 net4.5): privat

  • IntelliJ IDEA 编译报错:Error:java: Compilation failed: internal java compiler error2020-08-17 21:35:02

    报错内容: Information:java: javacTask: 源发行版 8 需要目标发行版 1.8 Information:java: Errors occurred while compiling module 'gulimall-common'Information:javac 1.8.0_91 was used to compile java sourcesInformation:Module "gulimall-common" was fully

  • ERROR org.hibernate.engine.jdbc.spi.SqlExceptionHelper - HikariPool-1 - Connection is not available,2020-06-24 10:03:52

    昨天遇到一个问题,开发说一个jar包启动后,几分钟就出现oracle数据库用户连接超时;但是该服务器上的其他war或jar都是正常连接数据库!!! 详细错误 Caused by: org.hibernate.exception.JDBCConnectionException: Unable to acquire JDBC Connection at org.hibernate.exception.inte

  • 解决"An internal error occurred during: "Launching XX on MyEclipse Tomcat ". java.lang.2020-06-06 22:05:27

    用myeclipse编程时修改了项目名后编译器一直报错,用这个方法解决了问题   原文链接:https://blog.csdn.net/qq_28631165/article/details/53365179 关于解决“An internal error occurred during: "Launching xx on MyEclipse Tomcat ". java.lang.NullPointerException”问题 "xx"

  • dashborad Internal Server Error2020-06-06 18:05:04

        httpd error log  

  • C#中的五种访问修饰符2020-06-02 22:04:07

    文章目录一、概述二、作用范围三、补充 一、概述 所有类型和类型成员都具有可访问性级别,用来控制是否可以在您程序集的其他代码中或其他程序集中使用它们。 可使用访问修饰符指定声明类型或成员的可访问性。 在C#语言中,共有五种访问修饰符:public、private、protected、inter

  • 内部服务器错误Internal server error解决方法2020-05-31 13:06:21

    这里说的内部服务器错误是网站前台能正常访问,而后台程序在执行某项任务/功能时所出现的内部服务器错误解决方法; 此错误通常是超时导致的,像程序在执行采集、静态页面生成时所耗时间太长导致达到超时限制的; 解决方法: 宝塔面板里打开Apache管理→性能调整→连接超时时间设置为120秒

  • pip install mysql-client 出错解决方式2020-04-28 21:00:06

    在使用 django 时,pip install mysql-client 出现如下报错:    从https://www.lfd.uci.edu/~gohlke/pythonlibs/#mysqlclient中下载合适自己python 版本使用 的 包 进入python        import pip._internal        print(pip._internal.pep425tags.get_supported()) 打印

  • IMP-00098: INTERNAL ERROR: impccr22020-04-07 10:00:13

    近期从正式库中导出数据库到测试库中,在测试库导入时报一个错误,但其它表导入都很正常的猜想可能是导入和导出时客户端的字符集不一致造成的。在正式环境oracle用户下查当前环境的字符集,env 用来显示环境变量:[oracle@wdb ~]$ env|grep LANGNLS_LANG=AMERICAN_AMERICA.ZHS16GBKLANG=en

  • 一些network的报错处理2020-04-06 17:02:35

    1.   报错   ERROR: Network internal declared as external, but could not be found. Please create the network manually using `docker network create internal` and try again. 是应该在docker-composs 中的定义了网桥  internal。  在实际环境中没有,需要手动创建

  • [CVE-2020-10199/10204] Nexus Repository Manager 3 RCE2020-04-04 17:05:47

    参考 https://support.sonatype.com/hc/en-us/articles/360044882533 https://cloud.tencent.com/announce/detail/1023 https://mp.weixin.qq.com/s/xUWPVwcNL6n6snn_gV_UwA https://www.exploit-db.com/docs/english/46303-remote-code-execution-with-el-injection-vuln

  • Gradle 6 Junit 5 测试错误2020-03-31 13:57:18

    在使用 Gradle 进行 build 的时候运行测试,提示 build 不能完成,测试不能进行。错误信息:Caused by: org.junit.platform.commons.PreconditionViolationException: Cannot create Launcher without at least one TestEngine; consider adding an engine implementatio

  • jsconfig.json: Unexpected token ] in JSON at position2020-03-25 17:53:43

    请检查 jsconfig.json 是否不符合 json 格式规范   > react-app-rewired startinternal/modules/cjs/loader.js:723 throw err; ^ SyntaxError: E:\work\xgz\jsconfig.json: Unexpected token ] in JSON at position 359 at JSON.parse (<anonymous>) at Object.

  • jeefast启动报错class jdk.internal.loader.ClassLoaders$AppClassLoader2020-03-17 09:45:38

    1.报错信息: Exception in thread "main" java.lang.ClassCastException: class jdk.internal.loader.ClassLoaders$AppClassLoader cannot be cast to class java.net.URLClassLoader (jdk.internal.loader.ClassLoaders$AppClassLoader and java.net.URLClassLoader a

  • SpringBoot加载速度慢2020-03-16 21:57:06

    创建项目时添加属性: archtypeCatalog = internal  

  • tips2020-03-15 18:00:36

    创建Maven项目的时候,archetypeCatalog = internal可以有效地快速搭建架包。 架包会因为网络波动等因素而造成架包不完整,会影响后续项目的构建。架包的完整性是十分重要的。 在陆续几天的学习当中,发现不管是什么课程也好,网课也罢。搭建实际性的理论框架对于理解是十分有效

  • Batch Normalization原理理解与作用2020-03-14 20:46:33

    一、原始神经网络层和Internal Covariate Shift问题 在原始DNN中,隐藏层(HiddenLayer)将输入x通过系数矩阵W相乘得到线性组合z=Wx,再通过激活函数a=f(z),得到隐藏层的输出a(X可以为输入层输入或者上一个隐藏层的输出),具体结构如下: 图中为一个批次(batch)的样本在隐藏层的传播过程

  • 从数据库中查询数据时报错No row with the given identifier exists: [com.oa.d_processvariable.Form#1]2020-03-10 16:36:29

    欢迎加入JavaWeb开发交流群:群号:1062758224 使用hibernate从数据库中查询数据时报错: org.hibernate.ObjectNotFoundException: No row with the given identifier exists: [com.oa.d_processvariable.Form#1] at org.hibernate.impl.SessionFactoryImpl$2.handleEntityNotFou

  • feign.FeignException: status 401 reading XXXXXX2020-03-09 20:44:57

    今天在调试微服务程序通过Feign调用外部服务时出现一个异常: feign.FeignException: status 401 reading xxxxxx at feign.FeignException.errorStatus(FeignException.java:60) at feign.codec.ErrorDecoder$Default.decode(ErrorDecoder.java:89) at feign.Synchronous

  • Ansible学习踩坑2020-03-08 10:56:48

    终于到了需要上Ansible的时候了,之前由于需求不强烈没有做,从今天起陆续记录学习。 常用ansible命令 查看组中的机器 ansible <group_name> list 查看内存使用(shell模块) ansible <host_name/group_name> -m command -a 'free -h' 查看主机磁盘容量(command模块) ansible <host_name/gr

  • Caused by: org.xml.sax.SAXParseException: cvc-elt.1: Cannot find the declaration of element 'be2020-03-08 10:44:17

    严重: Exception sending context initialized event to listener instance of class org.springframework.web.context.ContextLoaderListener org.springframework.beans.factory.xml.XmlBeanDefinitionStoreException: Line 5 in XML document from ServletContext resourc

  • 【Java】设计模式六大原则:开闭原则2020-03-05 20:03:12

    目录:    设计模式六大原则:单一职责原则   设计模式六大原则:接口隔离原则    设计模式六大原则:依赖倒置原则   设计模式六大原则:里氏替换原则   设计模式六大原则:迪米特法则   设计模式六大原则:开闭原则 开闭原则(Open Close Principle):   Software entities (c

  • org.gradle.api.tasks.TaskExecutionException: Execution failed for task ':app:processDebugManife2020-03-05 13:09:26

    一、问题 在添加第三方库等后,编译出现错误: org.gradle.api.tasks.TaskExecutionException: Execution failed for task ':health:processDebugManifest'.     at org.gradle.api.internal.tasks.execution.ExecuteActionsTaskExecuter.executeActions(ExecuteActionsTaskExe

  • typescript let 声明变量的坑2020-03-04 11:36:02

    typescript let 声明变量的坑 ts 文件编译后会把 let 编译成 var test.ts function fun() { var fa = '函数体内的'; { let fb = '函数体内块级作用域的'; console.log(fb); } console.log(fa); console.log(fb); } 编译后的test.js function fun() { var fa = "

专注分享技术,共同学习,共同进步。侵权联系[admin#icode9.com]

Copyright (C)ICode9.com, All Rights Reserved.

ICode9版权所有