ICode9

精准搜索请尝试: 精确搜索
  • error: invalid command 'bdist_wheel' Failed building wheel for xxx2021-07-31 19:01:52

    error: invalid command 'bdist_wheel' Failed building wheel for xxx 提示这个错误是因为没有wheel包,安装这个包即可。 pip install wheel 参考:Why is python setup.py saying invalid command 'bdist_wheel' on Travis CI?  

  • Jenkins groovy 修改build 结果为success或者failed2021-07-30 18:33:18

    有时候遇到jenkins 的build result并不是真正想要的状态,比如check是否有代码更新,如果没有代码更新,build result为failed,但是其实并没有编译,failed状态会造成误解。想要把failed强制改成success。可以使用Groovy强制修改状态。 使用Groovy postbuild插件       import hudson.

  • Rabbit health check failed:java.net.ConnectException: Connection refused: connect2021-07-30 14:32:07

    报错内容: 2021-07-30 14:16:53.619 [RMI TCP Connection(1)] WARN org.springframework.boot.actuate.amqp.RabbitHealthIndicator - Rabbit health check failed org.springframework.amqp.AmqpConnectException: java.net.ConnectException: Connection refused: connect

  • SpringBoot启动报错Failed to determine a suitable driver class2021-07-30 14:00:07

    SpringBoot启动报错Failed to determine a suitable driver classSpringBoot启动报错Failed to determine a suitable driver class 我的错误原因与网上其他的原因不同,故记录 项目结构: 我的项目是有继承关系的多模块结构 其中springboot的启动项在api模块中,由于项目原因,我将api

  • docker部署.Net5连接SqlServer出现 error: 31handshake failed2021-07-29 20:02:15

            之前的文章中,我们介绍了.netcore3.1连接sqlserver数据库时出现类似:A connection was successfully established with the server, but then an error occurred during the pre-login handshake. (provider: TCP Provider, error: 35 - An internal exception was caug

  • k8s部署gitlab报错Failed to create repository2021-07-28 10:35:11

    在k8s上部署gitlab正常访问,但是创建项目提示Failed to create repository gitlab-ctl tail gitlab-rails查看日志有err信息 redis ERR unknown command 'UNLINK'  原因:redis3.x版本太低导致,redis升级到5.x版本问题解决   总结:通过日志可以解决大部分问题

  • Java 使用jcifs读写共享文件夹报错jcifs.smb.SmbException: Failed to connect: 0.0.0.0<00>/10.1.*.*2021-07-26 18:34:36

    Q:使用jcifs读写Windows 10 共享文件夹中的文件报jcifs.smb.SmbException: Failed to connect: 0.0.0.0<00>/10.1.*.* A:Windows 10启用 SMB1.0 因为jcifs仅支持SMB1.0,像 SMB2/3都不再支持,不过官网也提供了其它可以参考使用的库。 看下JCIFS官网,就一目了然了

  • 【Android解决】无法打开data目录,Failed to pull selection open failed Permission denied2021-07-26 12:04:39

    【android解决】Failed to pull selection: open failed: Permission denied 问题:android Device monitor无法打开data目录下的文件 原因分析: 主要是用户没有权限造成的 解决方法 找到sdk的安装目录下,双击monitor.bat打开android device monitor管理器,如下图所示 然后会发

  • 单元测试出现:java.lang.IllegalStateException: Failed to load ApplicationContext2021-07-26 12:03:05

    在运行单元测试的时候出现:java.lang.IllegalStateException: Failed to load ApplicationContext java.lang.IllegalStateException: Failed to load ApplicationContext 查看错误提示: Description: Failed to configure a DataSource: ‘url’ attribute is not specif

  • This is probably because cuDNN failed to initialize问题解决2021-07-24 20:59:20

    anoconda在使用虚拟环境下的tensorflow模块时,经常会出现如下错误: UnknownError: Failed to get convolution algorithm. This is probably because cuDNN failed to initialize, so try looking to see if a warning log message was printed above. [Op:Conv2D] 可能很多帖

  • node-sass安装失败之npm ERR! Failed at the node-sass@4.9.4 postinstall script.2021-07-22 21:34:35

    node-sass安装失败之npm ERR! Failed at the node-sass@4.9.4 postinstall script. 一个npm install报了一堆问题 gyp verb check python checking for Python executable "python2" in the PATHgyp verb `which` failed Error: not found: python2gyp verb `which` failed at

  • 线上Kafka集群节点宕机问题排查2021-07-22 13:31:11

    线上Kafka集群节点宕机问题排查 主机和进程信息 主机和进程信息 主机信息:6cores,64G,5.3T Kafka进程信息:4G, partition 1K左右,消息数据量3.7T 今天上午发现Kafka有个节点挂了,上去查看日志发现有如下异常 Java HotSpot(TM) 64-Bit Server VM warning: Attempt to deallocate

  • 异常处理·IDEA执行Maven命令BUILD FAILURE2021-07-11 02:01:21

    阅文时长 | 0.32分钟 字数统计 | 519.2字符 主要内容 | 1、引言&背景 2、声明与参考资料 『异常处理·IDEA执行Maven命令BUILD FAILURE』 编写人 | SCscHero 编写时间 | 2021/7/11 AM1:10 文章类型 | 系列 完成度 | 已完成 座右铭 每一个伟大的事业,都有一个微不

  • XCode: Failed to instantiate the default view controller for UIMainStoryboardFile 'Main'2021-07-10 11:55:52

    Failed to instantiate the default view controller for UIMainStoryboardFile 'Main' - perhaps the designated entry point is not set?  这是因为给你的StoryBoard没有设置默认显示的controller, 解决方法:

  • Hexo部署出现错误err: Error: Spawn failed解决方式2021-07-10 11:36:12

    Hexo部署过程中可能会出现错误   fatal: unable to access 'https://github.com/a956551943/a956551943.github.io/': Encountered end of file FATAL { err: Error: Spawn failed at ChildProcess.<anonymous> (/usr/local/src/hexo/hanyubolg/node_modules/hex

  • gnutls_handshake() failed: Error in the pull function.2021-07-10 10:29:52

    git push origin master遇到这个错误 尝试无果后,采用博主的方法4提交成功,另外,GitHub从百度的搜索入口进去貌似更快一点,相比直接输网址或者用其他搜索入口 链接:gnutls_handshake() failed: Error in the pull function

  • nginx 无法启动:bind() to 0.0.0.0:443 failed2021-07-09 15:05:15

    bind to 0.0.0.0:443 failed.其实就是443端口被其它程序占用,要结束占用443端口导致nginx不能启动的应用。 CMD: 1.查看所有程序使用的端口 netstat -aon  也可以使用netstat -aon|findstr "443",直接找到使用443端口的程序: 可以看到PID为6416的程序占用了本机443端口。 接下来

  • 配置SSD-caffe测试时出现“Check failed: error == cudaSuccess (10 vs. 0) invalid device ordinal”解决方案2021-07-08 16:53:20

    这是由于GPU数量不匹配造成的,如果训练自己的数据,那么我们只需要将solver.prototxt文件中的device_id项改为自己的GPU块数,一块就是0,两块就是1,以此类推。 但是SSD配置时的例子是将训练语句整合成一个python文件ssd_pascal.py,所以需要改此代码。相关配置训练方法请参看转载博文: 解决

  • k8s v1.18.19 二进制安装问题集锦2021-07-08 15:32:49

    1、Image garbage collection failed once. Stats initialization may not have completed yet: failed to get imageFs info: unable to find data in memory cache 解决方法原地址 docker system prune systemctl stop kubelet systemctl stop docker systemctl start docker sy

  • CentOS7 安装psutil模块失败command 'gcc' failed with exit status 12021-07-08 14:35:29

    CentOS安装psutil包: python版本:3.6   wget https://pypi.python.org/packages/source/p/psutil/psutil-3.2.1.tar.gz --no-check-certificate tar zxvf psutil-3.2.1.tar.gz cd psutil-3.2.1 python setup.py install   执行python setup.py install时报错: gcc -pthread -fno-st

  • impdp导入数据报错解析2021-07-07 16:02:23

    参考:https://www.jianshu.com/p/ce96510b60c4?utm_campaign=haruki&utm_content=note&utm_medium=seo_notes&utm_source=recommendation https://blog.csdn.net/marvinhong/article/details/526910 https://support.oracle.com/knowledge/Oracle%20Database%20Prod

  • docker.service: Failed with result ‘exit-code‘2021-07-07 12:00:06

    docker.service: Failed with result 'exit-code'   查看日志: $ sudo dockerd --debug   看到是我们的daemon.json文件有问题    打开daemon.json sudo vim /etc/docker/daemon.json   改为 { "registry-mirrors": ["http://hub-mirror.c.163.com"] }  

  • assertion2021-07-06 15:55:40

    今天遇到一个偶现的崩溃:assertion "Pure virtual function called!" failed,发生的时机是在app退出的时候,目前掌握的信息比较少,还不清楚发生的具体原因,在此先记录一下。 /Volumes/Android/buildbot/src/android/ndk-r12-release/ndk/sources/cxx-stl/llvm- libc++abi/libcxxabi/src

  • Android Studio中报错2021-07-03 23:33:54

    Android Studio中报错 Caused by: org.gradle.api.internal.plugins.PluginApplicationException: Failed to apply plugin [id 'com.android.internal.application'] 解决办法 在项目中的gradle.properties文件中添加语句: android.overridePathCheck=true 参考来源:Android S

  • Laravel7 Failed to authenticate on SMTP server with username2021-07-03 14:51:59

    1.检查env文件是否正确配置 注意点(以QQ邮箱为例): (1) MAIL_USERNAME为qq邮箱而非QQ号 MAIL_PASSWORD 为授权码而非邮箱密码 (2) MAIL_PORT=465对应MAIL_ENCRYPTION=ssl 2.清除配置缓存 php artisan config:cache 3.  重启服务器

专注分享技术,共同学习,共同进步。侵权联系[admin#icode9.com]

Copyright (C)ICode9.com, All Rights Reserved.

ICode9版权所有